{"text_format":"1","workbook":"xlsx","n_sheets":19,"sheets":["Note for reviewers","Introduction","NitrogenCopies","Practice Information","Nitrogen Practices","Decision Helper","Core Help","Core Worksheet Data","Core Cost Data","Cover Crops","Living Mulch","Energy Crops","Bioreactors","Drainage Management","Buffers","Grazed Pasture","Extended Rotations","Wetlands","Fertilizer"],"not_rendered":{"charts":0,"images":16,"macros":1,"external_links":0,"defined_names":0,"comments":0,"pivot_tables":0},"unopened":[],"bounds":{"document_bytes":16777216,"sheet_cells":100000,"rows_first":2000,"rows_last":500,"rows_between":2000,"halvings":0,"cell_chars":16384,"cell_head_chars":4096},"cells_cut":0,"cells_raw":0,"read":"whole","date_system":"1900"}

{"sheet":"Note for reviewers","index":0,"n_rows":49,"n_cols":6,"rows_kept":49,"cut":false,"hidden":true,"merged":[]}
[]
[]
[null,"Note from Troy Bowman:"]
[]
[null,"Hello.  Thanks for agreeing to review the worksheets in this tool.  Your feedback will make this tool more accurate and useful to both you and the general public.  It is important that the tool "]
[null,"be both accurate and through as for some, this will be a primary source of information with regard to making nutrient reduction practice decisions on their land.  With that in mind, feel free to be"]
[null,"as picky and brutal as necessary."]
[]
[null,"Areas to provide feedback:"]
[null,"While any feedback is appreciated, it would be helpful, in particular, to have comments about the following:"]
[null,null,"Default values used",null,"(too high?, too low?)"]
[null,null,"Practice steps",null,"(is the list of steps complete enough, are there steps that need to be added, or taken away)"]
[null,null,"General look",null,"(are the steps and information laid out in a manner that is easy to follow and understand)"]
[null,null,"Decision helper",null,"(are there any additional scenarios that should be added)"]
[null,null,"Wetlands",null,"(should we approach wetland creation from a CRP-style large wetland angle, or focus more on smaller detention type wetlands)"]
{"$rows_left_out":35}
{"sheet":"Introduction","index":1,"n_rows":36,"n_cols":4,"rows_kept":36,"cut":false,"hidden":false,"merged":[]}
[]
[]
[]
[]
[]
[]
[]
[null,"The State of Iowa through the Department of Natural Resources and Department of Agriculture, and in partnership with Iowa State University"]
[null,"and the US Department of Agriculture, has developed a science and technology-driven strategy to assess and reduce the nutrients entering Iowa's"]
[null,"waterways and in turn, the Gulf of Mexico.  This strategy is built around proven best management practices that reduce the nitrogen and"]
[null,"phosphorus delivered by agricultural landscapes.  "]
[]
[null,"As a voluntary program, farmers can decide for themselves what practices they want to employ and how best to manage nutrient loss from"]
[null,"their operations.  This decision support tool is the first in a suite of instruments created to help farmers with those decisions."]
[]
{"$rows_left_out":22}
{"sheet":"NitrogenCopies","index":2,"n_rows":42,"n_cols":1,"rows_kept":42,"cut":false,"hidden":true,"merged":[]}
["Nitrogen Management Practices"]
[]
["The following set of practices include operational variations that change the type and amount of nitrogen used, the timing of "]
["its application, or use infield mulches or cover crops to limit nitrogen loss."]
[]
["Click on a button below to open a brief description of the practice and links to both the economic worksheet and a website."]
[]
[]
[]
[]
[]
[]
[]
[]
[]
{"$rows_left_out":28}
{"sheet":"Practice Information","index":3,"n_rows":60,"n_cols":50,"rows_kept":60,"cut":false,"hidden":true,"merged":[[41,41,43,45],[45,41,51,44],[52,41,59,44],[1,31,3,35],[5,31,11,34],[12,31,19,34],[45,21,51,24],[52,21,59,24],[41,31,43,35],[45,31,51,34],[52,31,59,34],[32,21,39,24],[21,31,23,35],[25,31,31,34],[32,31,39,34],[41,21,43,25],[1,21,3,25],[5,21,11,24],[12,21,19,24],[21,21,23,25],[25,21,31,24],[1,11,3,15],[5,11,11,14],[12,11,19,14],[45,11,53,14],[54,11,59,14],[21,11,23,15],[25,11,31,14],[32,11,39,14],[41,11,43,15]]}
[]
[null,"PRACTICE NAME HERE",null,null,null,null,null,"ISU Logo",null,null,null,"Cover Crops",null,null,null,null,null,null,null,null,null,"N Management",null,null,null,null,null,null,null,null,null,"Living Mulches"]
[]
[null,"Practice Code"]
[]
[null,null,"Text info on Practice",null,null,null,null,null,null,null,null,"Cover crops, which are planted in the late summer or early fall before or just after harvest, can reduce soil erosion, limit the loss of nitrogen, control weeds, increase soil organic matter and quality.",null,null,null,null,null,null,null,null,null,"Improved nitrogen management is about choosing the application rate, source, and timing of nitrogen fertilizer to provide the most effective balance of crop yield and nutrient cost.  ",null,null,null,null,null,null,null,null,null,"Living mulches (such as Kura clover) are plant systems that are grown along with other crops and reduce erosion, provide weed control, and provide nitrogen fixation."]
[null,null,null,null,null,null,"Picture"]
[]
[]
[]
[]
[]
[null,null,null,null,null,null,null,null,null,null,null,"On average, cover crops have been shown to reduce nitrogen loss by 31% and phosphorus loss by 29%. ",null,null,null,null,null,null,null,null,null,"On average, improved N management has been shown to reduce nitrogen loss by 4% to 10% depending on the particular practice used. ",null,null,null,null,null,null,null,null,null,"On average, living mulches have been shown to reduce nitrogen loss by 41%."]
[]
[]
{"$rows_left_out":46}
{"sheet":"Nitrogen Practices","index":4,"n_rows":46,"n_cols":19,"rows_kept":46,"cut":false,"hidden":true,"merged":[[27,10,29,14],[31,10,37,13],[38,10,45,13]]}
[]
[]
[]
[]
[]
[null,"Nutrient Reduction Practices"]
[]
[null,"93% of Iowa's total nitrogen stream load comes from non-point sources, such as farmland. The Iowa Nutrient Reduction Strategy has set a goal of reducing "]
[null,"this by nitrogen loss 41%.  Effective use of a combination of these proven best management practices below will help to meet that goal and better protect the waterways "]
[null,"in Iowa and further downstream."]
[]
[null,"Best management practices have been divided into three major categories: Nitrogen Management, Land Use, and Edge of Field.  To explore the practices in each of these "]
[null,"sections, click on the appropriate button below:"]
[]
[]
{"$rows_left_out":32}
{"sheet":"Decision Helper","index":5,"n_rows":271,"n_cols":22,"rows_kept":271,"cut":false,"hidden":false,"merged":[[81,1,88,4],[16,1,18,5],[16,11,18,15],[20,1,28,4],[20,11,26,14],[27,11,34,14],[29,1,34,4],[43,1,45,5],[47,1,53,4],[54,1,61,4],[70,1,72,5],[74,1,80,4],[97,1,99,5],[97,11,99,15],[101,1,107,4],[101,11,107,14],[108,1,115,4],[108,11,115,14],[155,1,161,4],[155,11,161,14],[162,1,169,4],[162,11,169,14],[124,1,126,5],[124,11,126,15],[128,1,134,4],[128,11,134,14],[135,1,142,4],[135,11,142,14],[270,1,277,4],[232,31,234,35],[236,1,244,4],[236,11,242,14],[236,21,242,24],[236,31,242,34],[243,11,250,14],[243,21,250,24],[243,31,250,34],[245,1,250,4],[232,21,234,25],[232,1,234,5],[232,11,234,15],[16,21,18,25],[20,21,26,24],[27,21,34,24],[259,1,261,5],[263,1,269,4],[205,1,207,5],[209,1,215,4],[216,1,223,4],[178,1,180,5],[178,11,180,15],[182,1,188,4],[182,11,188,14],[189,1,196,4],[189,11,196,14],[151,1,153,5],[151,11,153,15]]}
[]
[]
[]
[]
[]
[]
[]
[]
["This worksheet is designed to help you match different nutrient reduction practices to the individual needs of your farm operation.  There are a variety of different statements listed below."]
["Each statement has a button next to it that can be clicked to display a set of related best management practices.  You can then examine each listed practice further by opening the worksheet or clicking the link to  "]
["visit the website in your default web browser."]
[]
["1. I am interested in treating the water coming from my tile drainage system to reduce nitrogen."]
[]
[null,"You might be interested in trying…"]
{"$rows_left_out":257}
{"sheet":"Core Help","index":6,"n_rows":47,"n_cols":1,"rows_kept":47,"cut":false,"hidden":true,"merged":[[46,0,46,4]]}
[]
["Cover Crops Information"]
[]
["2016 Iowa EQIP Basic Payment Rates Chemical or mechanical kill cover crop species—$40.13/Ac.  Establishment must meet NRCS standards and may not be available in all districts.  Contact your local NRCS or Iowa State Extension agent for details."]
["Default seed prices are for cereal rye."]
["Early aerial or high-clearance broadcasting is recommended.  Best establishment will occur immediately following the soybean leaf yellowing or black layer on corn.  In addition, field conditions that are too dry (less than 0.25\" of rain) may inhibit establishment success."]
[]
[]
[]
["Bioreactor Information"]
[]
["In Iowa, bioreactors may be funded through the Environmental Quality Incentive Program (EQIP) under Practice Code 605. Basic 2016 EQIP payments start at $24.85 per cubic yard of pit excavation. Check with your local NRCS agent for more details and availability."]
["Mineral soils are soils that either: contain less than 20% organic matter and are saturated less than 30 days out of the year; or if saturated for more than 30 days (or artifically drained) contain less than (12 + n)% organic matter where n = 0.1 * the percentage of clay in the soil (Example: less than 18% organic matter when 60% of the soil is clay)."]
["The drainage coefficient is the amount of water (in inches) to be removed in 24 hours."]
["Design costs may be assessed by private engineering firms, but may be waived if assistance is obtained through public technical service providers such as the NRCS or Iowa State Extension."]
{"$rows_left_out":33}
{"sheet":"Core Worksheet Data","index":7,"n_rows":16,"n_cols":2,"rows_kept":16,"cut":false,"hidden":true,"merged":[]}
["Practice Code","URL"]
["FERT2014","http://www.nrem.iastate.edu/bmpcosttools/about"]
["COVER2014","http://mccc.msu.edu/index.htm"]
["LIVING2014","http://www.nrem.iastate.edu"]
["ENERGY2014","https://www.extension.iastate.edu/agdm/crops/html/a1-22.html"]
["EXTEND2014","http://www.leopold.iastate.edu/faq-cropping-system-diversity-profitability"]
["GRAZED2014","http://www.nrem.iastate.edu"]
["DRAIN2014","http://www.sustainablecorn.org/In_Field_Management/drainage_water_management.html"]
["WETLAND2014","https://connect.extension.iastate.edu/p5uk06thjcb/?launcher=false&fcsContent=true&pbMode=normal"]
["BIOREACT2014","https://store.extension.iastate.edu/product/Woodchip-Bioreactors-for-Nitrate-in-Agricultural-Drainage"]
["BUFFER2014","file:///C:/Users/jtyndall/Downloads/PM1626A.pdf"]
["SATBUFF2014","https://store.extension.iastate.edu/product/Cleaning-Iowas-Waters-with-Saturated-Buffers-in-Iowa-Watersheds"]
[]
["Default"]
["Yes"]
{"$rows_left_out":2}
{"sheet":"Core Cost Data","index":8,"n_rows":305,"n_cols":11,"rows_kept":305,"cut":false,"hidden":true,"merged":[]}
[]
["Cover Crops",null,"Planting Cost",null,null,"Seed Cost",null,null,null,"Source: Tom Kaspar, 2014, Duffy, 2014)"]
[null,"Variable Number","Min","Avg","Max","Min","Avg","Max","pds/acre"]
[]
["Aerial Seeding",1,7.5,11,16,{"$f":"0.2*I5","v":24},{"$f":"0.3*I5","v":36},{"$f":"0.4*I5","v":48},120]
["Ground Broadcast Seeding",2,6.5,14.55,20,{"$f":"0.2*I6","v":20},{"$f":"0.3*I6","v":30},{"$f":"0.4*I6","v":40},100]
["Seed Grass Drilling",3,10,16.350000000000001,25,16,24,32,80]
[null,null,"Total Costs"]
[null,null,"Min","Avg","Max"]
["Disking",1,8,16.75,25.5,"Base Cost (Spraying)",null,null,"Round-up Cost","NASS, 2014"]
["Herbicide (glyphosate, 1 qt/acre)",2,10,18.43,{"$f":"H11+I11","v":19.55},5,7.4,15,4.55,"Duffy, 2014"]
[]
["Formulas Planting",null,"Formulas Seed Cost",null,"Formulas Termination","Formulas Crop"]
[{"$f":"VLOOKUP($A$42,'Core Cost Data'!$B$5:$C$7,2)","v":{"$error":"#N/A"}},"Min Dropdown",{"$f":"VLOOKUP($A$42,'Core Cost Data'!$B$5:$I$7,5)","v":{"$error":"#N/A"}},null,{"$f":"VLOOKUP($A$62,'Core Cost Data'!$B$10:$C$11,2)","v":{"$error":"#N/A"}},{"$f":"VLOOKUP($A$74,'Core Cost Data'!$B$18:$F$19,3)","v":{"$error":"#N/A"}},"Yield"]
[{"$f":"VLOOKUP($A$42,'Core Cost Data'!$B$5:$E$7,3)","v":{"$error":"#N/A"}},"Avg Dropdown",{"$f":"VLOOKUP($A$42,'Core Cost Data'!$B$5:$I$7,6)","v":{"$error":"#N/A"}},null,{"$f":"VLOOKUP($A$62,'Core Cost Data'!$B$10:$E$11,3)","v":{"$error":"#N/A"}},{"$f":"VLOOKUP($A$74,'Core Cost Data'!$B$18:$H$19,5)","v":{"$error":"#N/A"}},"Reduction","Default Acres",40]
{"$rows_left_out":291}
{"sheet":"Cover Crops","index":9,"n_rows":141,"n_cols":21,"rows_kept":141,"cut":false,"hidden":false,"merged":[]}
[]
[]
[]
[]
[]
[]
[]
[null,"Cover Crops (Cereal Rye)"]
[]
[null,"Cover crops, which are planted in the late summer or early fall before or just after harvest, can reduce "]
[null,"soil erosion, limit the loss of nitrogen, control weeds, and increase soil quality.  In Iowa, these crops "]
[null,"generally consist of winter hardy species, such as cereal rye or wheat.  Hairy vetch and oats can be also be used. "]
[null,"In addition to reducing nutrient loss, these crops can provide grazing or forage material for livestock or wildlife."]
[]
[null,"Generally speaking, there are three phases involved in using cover crops: Establishment, Growth, and Termination."]
{"$rows_left_out":127}
{"sheet":"Living Mulch","index":10,"n_rows":167,"n_cols":11,"rows_kept":167,"cut":false,"hidden":true,"merged":[]}
[]
[]
[]
[]
[]
[]
[]
[null,"Living Mulches (Kura Clover)"]
[]
[null,"Living mulch is a permanent land cover (in Iowa, mainly Kura clover) that is grown within a row crop field."]
[null,"The living mulch reduces the amount of soil loss and enhances a soil's physical structure.  In addition, Kura clover is a "]
[null,"nitrogen-fixer that uses fungi located in root nodules to add nitrogen to the soil."]
[]
[null,"However, living mulches can be very difficult to establish and have very specific management requirements (which can"]
[null,"include a year of establishment before a row crop can be planted)."]
{"$rows_left_out":153}
{"sheet":"Energy Crops","index":11,"n_rows":334,"n_cols":14,"rows_kept":334,"cut":false,"hidden":true,"merged":[[167,2,167,4],[167,5,167,7],[167,8,167,10]]}
[]
[]
[]
[]
[]
[]
[]
[null,"Energy Crops (Switchgrass)"]
[]
[null,"Energy crops are a perennial crop grown with the intent of using the biomass harvested as a feedstock for biofuel production.  In Iowa, Switchgrass is the most commonly grown energy crop with "]
[null,"Miscanthus becoming an emerging option.  "]
[]
[null,"The potential for energy crops, at the current time, is largely limited by localized markets and the distance required to transport the biomass to an appropriate refinery.  As more biofuel infrastructure is created,"]
[null,"energy crops with become viable in more areas.  "]
[]
{"$rows_left_out":320}
{"sheet":"Bioreactors","index":12,"n_rows":396,"n_cols":15,"rows_kept":396,"cut":false,"hidden":false,"merged":[[169,0,169,7]]}
[]
[]
[]
[]
[]
[]
[]
[null,"Bioreactors"]
[]
[null,"Denitrifying bioreactors are constructed trenches filled with woodchips that filter a portion of the water passing through"]
[null,"a field's tile drainage system.  Bacteria use nitrogen in the water to feed on the carbon stored in the woodchips."]
[null,"The small footprint of the system eliminates the need to take land out of production, and the long life"]
[null,"and low maintenance of the bioreactor reduces need for active management.  Bioreactors are generally applied"]
[null,"to areas up to 80 acres."]
[]
{"$rows_left_out":382}
{"sheet":"Drainage Management","index":13,"n_rows":396,"n_cols":11,"rows_kept":396,"cut":false,"hidden":false,"merged":[[214,2,214,4],[214,5,214,7],[91,9,93,10],[90,9,90,10]]}
[]
[]
[]
[]
[]
[]
[]
[null,"Drainage Management"]
[]
[null,"Subsurface drainage is a common land management for farm fields across Iowa and the Midwest.  Drainage management is the practice of using water control structures or tile line depth to "]
[null,"manipulate the height of a field's water table and the amount of water leaving a field through tile drainage.  There are two main strategies used in drainage management: shallow drainage and "]
[null,"controlled drainage.  Drainage management does not affect corn yields or n-concentrations in water leaving the field.  However, the practice does greatly reduce the amount of water loss."]
[]
[null,"Shallow drainage raises the depth of tile line while placing tile lines closer together.  There is no significant maintanence costs; however, the practice is only for new tile systems."]
[]
{"$rows_left_out":382}
{"sheet":"Buffers","index":14,"n_rows":318,"n_cols":15,"rows_kept":318,"cut":false,"hidden":false,"merged":[[153,2,153,4],[153,5,153,7]]}
[]
[]
[]
[]
[]
[]
[]
[null,"Vegetative buffers"]
[]
[null,"Vegetative buffers are areas of land in between crop fields and streams (or other water bodies) that are planted with a variety of grasses and/or trees."]
[null,"Buffers intercept surface waterflow and allow the planted vegetation to absorb and filter the water before releasing it into the neighboring stream."]
[null,"The width and length of the buffer will be dependent on the desired nutrient reduction, soil and topography characteristics and management goals.  "]
[]
[null,"In addition to nutrient reductions, buffers can provide a suite of non-market benefits including wildlife and pollinator habitat, flood protection, "]
[null,"and in some cases, can provide habitat for predator insect species that prey on crop pests."]
{"$rows_left_out":304}
{"sheet":"Grazed Pasture","index":15,"n_rows":315,"n_cols":11,"rows_kept":315,"cut":false,"hidden":true,"merged":[[167,2,167,4],[167,5,167,7],[167,8,167,10]]}
[]
[]
[]
[]
[]
[]
[]
[null,"Grazed Pasture"]
[]
[null,"Grazed pature conversion is the practice of removing a field from row crop production, and placing the field in a grazed pasture management scheme.  The grazed pasture may be used for either "]
[null,"livestock owned by the farmer or can be rented out to other livestock producers.  Grazed pastures can be managed as intensively or rotationally grazed depending on the farmers preference."]
[]
[null,"Large areas of Iowa are in permanent pasture and additional land could be used to develop emerging markets for grass-fed or organic livestock.  Pasture land has very little nutrient leaching and erosion, "]
[null,"and can help enhance soil organic carbon and structure.  Grazed pastures can be an attractive alternative for land that is currently economically marginal to row crop production."]
[]
{"$rows_left_out":301}
{"sheet":"Extended Rotations","index":16,"n_rows":421,"n_cols":12,"rows_kept":421,"cut":false,"hidden":true,"merged":[[233,2,233,4],[233,5,233,7],[233,8,233,10],[221,2,221,4],[221,5,221,7],[221,8,221,10]]}
[]
[]
[]
[]
[]
[]
[]
[null,"Extended Rotations (Alfalfa)"]
[]
[null,"Extended rotations is the practice of interspersing forage crops (such as alfalfa) in a row crop production rotation.  The crop and rotation schedule can differ depending on the desired "]
[null,"management schedule.  Alfalfa is often used because of its high forage value and nitrogen-fixing capablilites."]
[]
[null,"Extended rotations can reduce soil erosion and suppress weeds in the field reducing the future need for herbicide treatments.  In addition, the nitrogen-fixing abilities of alfalfa lead to reductions "]
[null,"in the need for nitrogen fertilizer in corn crops following termination of alfalfa crops.  "]
[]
{"$rows_left_out":407}
{"sheet":"Wetlands","index":17,"n_rows":326,"n_cols":15,"rows_kept":326,"cut":false,"hidden":false,"merged":[[152,2,152,4],[152,5,152,7]]}
[]
[]
[]
[]
[]
[]
[]
[null,"Wetlands (Constructed/Restored)"]
[]
[null,"Wetlands are engineered impoundment systems that capture and filter water through a range of vegetative, soil and microbial processes.  Wetlands are generally large in size "]
[null,"and are placed on the landscape using percision mapping programs based on soil profile, topography and upstream activity.  Size is determined based on the "]
[null,"amount of acres draining into the wetland location."]
[]
[null,"Because they are sizable, wetlands tend to be more expensive than other practices with substantial design and construction costs and large areas of land removed from production."]
[null,"Because of this, wetlands are often financed through a government cost-sharing program.  "]
{"$rows_left_out":312}
{"sheet":"Fertilizer","index":18,"n_rows":97,"n_cols":12,"rows_kept":97,"cut":false,"hidden":true,"merged":[[79,6,79,7],[71,6,71,7]]}
[]
[]
[]
[]
[]
[]
[]
[null,"Fertilizer Management (Nitrogen)"]
[]
[null,"Nitrogen management is the practice of controlling the timing, application rate, and type of fertilizer used in grain production. Smart management has the potential to reduce nitrogen loss while maintaining yields."]
[]
[null,"Iowa farmers use a variety of ways to determine their N rate.  Recent surveys have shown that farmers rely mainly on yield goals, recommendations from fertilizer dealers and past experience to set N rates."]
[null,"An alternative way that could reduce N loss is the MRTN (Maximum Return to Nitrogen) was developed by university specialists in the Corn Belt as a method of calculating an application rate that would "]
[null,"find the rate at which the economic net return return is maximized.  The MRTN is backed by field trials in states across the Midwest and is determined based on a ratio of fertilizer price to corn grain price."]
[]
{"$rows_left_out":82}